BDBM50373413 CHEMBL257603
SMILES CN(CC=C)C(=O)[C@]1(C[C@H]1CN)c1ccsc1
InChI Key InChIKey=IQIONMXYTYNILR-WCQYABFASA-N
Data  3 IC50
  Tab Delimited (TSV)   2D SDfile   Computed 3D by Vconf -m prep SDfile
Find this compound or compounds like it in BindingDB:
Activity Spreadsheet -- Enzyme Inhibition Constant Data from BindingDB
Found 1 hit for monomerid = 50373413
TargetSodium-dependent noradrenaline transporter(Homo sapiens (Human))
Neurocrine Bioscience
Curated by ChEMBL
LigandPNGBDBM50373413(CHEMBL257603)
Affinity DataIC50:  100nM. Assay description: Inhibition of norepinephrine uptake at human NET expressed in HEK293 cells
In DepthDetails ArticlePubMed